{"text_format":"3","workbook":"xlsx","n_sheets":3,"sheets":["Supply Disruption Form","Contact Information","Contracts (April 2022)"],"not_rendered":{"images":1,"macros":1,"defined_names":80,"comments":1},"read":"whole","date_system":"1900"}

{"sheet":"Supply Disruption Form","index":0,"n_rows":393,"n_cols":28,"rows_kept":393,"merged":[[1,3,1,7],[4,3,4,7],[10,16,10,23],[11,25,11,27]]}
["SUPPLY DISRUPTION REPORTING FORM"]
["CONFIDENTIAL - NOT FOR DISTRIBUTION"]
["Supplier name:"]
["Name of sender:"]
["Email address of sender:"]
["Phone number of sender:"]
["Service/Category:"]
[]
["  Legend:"]
[]
[{"$nulls":16},"Note to suppliers:\n-In the event an awarded product is to become permanently unavailable, Supplier will provide HealthPRO with sixty (60) days’ advance written notice.\n-Price of the substitute product needs to be the same or lower (otherwise Supplier will pay the differential)"]
[{"$nulls":16},"Details of Available Substitutes Proposed by the Supplier",{"$nulls":8},"Clinical Advisor"]
["Nature of disruption \nBackorder\nDiscontinuation with Substitute\nDiscontinuation with No Substitute","Cause of Disruption\n(Please include detailed reason)","National/ Provincial?\n(If provincial, please indicate the affected provinces)","Contract Number\ne.g. (01234)","Contract Name","Supplier Product Code","Supplier Product Description","Brand","Is this a Current or Future Disruption?","Disruption Start Date \n(MM/DD/YY)","Estimated Date of Recovery\n(MM/DD/YY)","Is Stock Available for Purchase? (Yes/No)\n(If Yes, When will stock become unavailable?)","If product is on allocation, please provide % of allocation","Please upload any communication related to this disruption","Notes",null,"Is this item currently on contract? (Yes/No)","Supplier Code","Product Description      (GS1 - Compliant Format Preferred)","Brand","Size(V)","Latex \n(Yes/No)\n(if applicable)","Clinical differences between original and substitute product","Please provide substitute product information (Weblinks, Brochures, etc.)",null,"Is the product critical in nature?","Is the substitute Functionally Equivalent?","Remarks"]
[{"$nulls":4},{"$f":"IFERROR(VLOOKUP(D14,'Contracts (April 2022)'!C1:L522,3,FALSE),\"\")","v":""}]
[{"$nulls":4},{"$f":"IFERROR(VLOOKUP(D15,'Contracts (April 2022)'!C2:L523,3,FALSE),\"\")","v":""}]
[{"$nulls":4},{"$f":"IFERROR(VLOOKUP(D16,'Contracts (April 2022)'!C3:L524,3,FALSE),\"\")","v":""}]
[{"$nulls":4},{"$f":"IFERROR(VLOOKUP(D17,'Contracts (April 2022)'!C4:L525,3,FALSE),\"\")","v":""}]
[{"$nulls":4},{"$f":"IFERROR(VLOOKUP(D18,'Contracts (April 2022)'!C5:L526,3,FALSE),\"\")","v":""}]
[{"$nulls":4},{"$f":"IFERROR(VLOOKUP(D19,'Contracts (April 2022)'!C6:L527,3,FALSE),\"\")","v":""}]
[{"$nulls":4},{"$f":"IFERROR(VLOOKUP(D20,'Contracts (April 2022)'!C7:L528,3,FALSE),\"\")","v":""}]
[{"$nulls":4},{"$f":"IFERROR(VLOOKUP(D21,'Contracts (April 2022)'!C8:L529,3,FALSE),\"\")","v":""}]
[{"$nulls":4},{"$f":"IFERROR(VLOOKUP(D22,'Contracts (April 2022)'!C9:L530,3,FALSE),\"\")","v":""}]
[{"$nulls":4},{"$f":"IFERROR(VLOOKUP(D23,'Contracts (April 2022)'!C10:L531,3,FALSE),\"\")","v":""}]
[{"$nulls":4},{"$f":"IFERROR(VLOOKUP(D24,'Contracts (April 2022)'!C11:L532,3,FALSE),\"\")","v":""}]
[{"$nulls":4},{"$f":"IFERROR(VLOOKUP(D25,'Contracts (April 2022)'!C12:L533,3,FALSE),\"\")","v":""}]
[{"$nulls":4},{"$f":"IFERROR(VLOOKUP(D26,'Contracts (April 2022)'!C13:L534,3,FALSE),\"\")","v":""}]
[{"$nulls":4},{"$f":"IFERROR(VLOOKUP(D27,'Contracts (April 2022)'!C14:L535,3,FALSE),\"\")","v":""}]
[{"$nulls":4},{"$f":"IFERROR(VLOOKUP(D28,'Contracts (April 2022)'!C15:L536,3,FALSE),\"\")","v":""}]
[{"$nulls":4},{"$f":"IFERROR(VLOOKUP(D29,'Contracts (April 2022)'!C16:L537,3,FALSE),\"\")","v":""}]
[{"$nulls":4},{"$f":"IFERROR(VLOOKUP(D30,'Contracts (April 2022)'!C17:L538,3,FALSE),\"\")","v":""}]
[{"$nulls":4},{"$f":"IFERROR(VLOOKUP(D31,'Contracts (April 2022)'!C18:L539,3,FALSE),\"\")","v":""}]
[{"$nulls":4},{"$f":"IFERROR(VLOOKUP(D32,'Contracts (April 2022)'!C19:L540,3,FALSE),\"\")","v":""}]
[{"$nulls":4},{"$f":"IFERROR(VLOOKUP(D33,'Contracts (April 2022)'!C20:L541,3,FALSE),\"\")","v":""}]
[{"$nulls":4},{"$f":"IFERROR(VLOOKUP(D34,'Contracts (April 2022)'!C21:L542,3,FALSE),\"\")","v":""}]
[{"$nulls":4},{"$f":"IFERROR(VLOOKUP(D35,'Contracts (April 2022)'!C22:L543,3,FALSE),\"\")","v":""}]
[{"$nulls":4},{"$f":"IFERROR(VLOOKUP(D36,'Contracts (April 2022)'!C23:L544,3,FALSE),\"\")","v":""}]
[{"$nulls":4},{"$f":"IFERROR(VLOOKUP(D37,'Contracts (April 2022)'!C24:L545,3,FALSE),\"\")","v":""}]
[{"$nulls":4},{"$f":"IFERROR(VLOOKUP(D38,'Contracts (April 2022)'!C25:L546,3,FALSE),\"\")","v":""}]
[{"$nulls":4},{"$f":"IFERROR(VLOOKUP(D39,'Contracts (April 2022)'!C26:L547,3,FALSE),\"\")","v":""}]
[{"$nulls":4},{"$f":"IFERROR(VLOOKUP(D40,'Contracts (April 2022)'!C27:L548,3,FALSE),\"\")","v":""}]
[{"$nulls":4},{"$f":"IFERROR(VLOOKUP(D41,'Contracts (April 2022)'!C28:L549,3,FALSE),\"\")","v":""}]
[{"$nulls":4},{"$f":"IFERROR(VLOOKUP(D42,'Contracts (April 2022)'!C29:L550,3,FALSE),\"\")","v":""}]
[{"$nulls":4},{"$f":"IFERROR(VLOOKUP(D43,'Contracts (April 2022)'!C30:L551,3,FALSE),\"\")","v":""}]
[{"$nulls":4},{"$f":"IFERROR(VLOOKUP(D44,'Contracts (April 2022)'!C31:L552,3,FALSE),\"\")","v":""}]
[{"$nulls":4},{"$f":"IFERROR(VLOOKUP(D45,'Contracts (April 2022)'!C32:L553,3,FALSE),\"\")","v":""}]
[{"$nulls":4},{"$f":"IFERROR(VLOOKUP(D46,'Contracts (April 2022)'!C33:L554,3,FALSE),\"\")","v":""}]
[{"$nulls":4},{"$f":"IFERROR(VLOOKUP(D47,'Contracts (April 2022)'!C34:L555,3,FALSE),\"\")","v":""}]
[{"$nulls":4},{"$f":"IFERROR(VLOOKUP(D48,'Contracts (April 2022)'!C35:L556,3,FALSE),\"\")","v":""}]
[{"$nulls":4},{"$f":"IFERROR(VLOOKUP(D49,'Contracts (April 2022)'!C36:L557,3,FALSE),\"\")","v":""}]
[{"$nulls":4},{"$f":"IFERROR(VLOOKUP(D50,'Contracts (April 2022)'!C37:L558,3,FALSE),\"\")","v":""}]
[{"$nulls":4},{"$f":"IFERROR(VLOOKUP(D51,'Contracts (April 2022)'!C38:L559,3,FALSE),\"\")","v":""}]
[{"$nulls":4},{"$f":"IFERROR(VLOOKUP(D52,'Contracts (April 2022)'!C39:L560,3,FALSE),\"\")","v":""}]
[{"$nulls":4},{"$f":"IFERROR(VLOOKUP(D53,'Contracts (April 2022)'!C40:L561,3,FALSE),\"\")","v":""}]
[{"$nulls":4},{"$f":"IFERROR(VLOOKUP(D54,'Contracts (April 2022)'!C41:L562,3,FALSE),\"\")","v":""}]
[{"$nulls":4},{"$f":"IFERROR(VLOOKUP(D55,'Contracts (April 2022)'!C42:L563,3,FALSE),\"\")","v":""}]
[{"$nulls":4},{"$f":"IFERROR(VLOOKUP(D56,'Contracts (April 2022)'!C43:L564,3,FALSE),\"\")","v":""}]
[{"$nulls":4},{"$f":"IFERROR(VLOOKUP(D57,'Contracts (April 2022)'!C44:L565,3,FALSE),\"\")","v":""}]
[{"$nulls":4},{"$f":"IFERROR(VLOOKUP(D58,'Contracts (April 2022)'!C45:L566,3,FALSE),\"\")","v":""}]
[{"$nulls":4},{"$f":"IFERROR(VLOOKUP(D59,'Contracts (April 2022)'!C46:L567,3,FALSE),\"\")","v":""}]
[{"$nulls":4},{"$f":"IFERROR(VLOOKUP(D60,'Contracts (April 2022)'!C47:L568,3,FALSE),\"\")","v":""}]
[{"$nulls":4},{"$f":"IFERROR(VLOOKUP(D61,'Contracts (April 2022)'!C48:L569,3,FALSE),\"\")","v":""}]
[{"$nulls":4},{"$f":"IFERROR(VLOOKUP(D62,'Contracts (April 2022)'!C49:L570,3,FALSE),\"\")","v":""}]
[{"$nulls":4},{"$f":"IFERROR(VLOOKUP(D63,'Contracts (April 2022)'!C50:L571,3,FALSE),\"\")","v":""}]
[{"$nulls":4},{"$f":"IFERROR(VLOOKUP(D64,'Contracts (April 2022)'!C51:L572,3,FALSE),\"\")","v":""}]
[{"$nulls":4},{"$f":"IFERROR(VLOOKUP(D65,'Contracts (April 2022)'!C52:L573,3,FALSE),\"\")","v":""}]
[{"$nulls":4},{"$f":"IFERROR(VLOOKUP(D66,'Contracts (April 2022)'!C53:L574,3,FALSE),\"\")","v":""}]
[{"$nulls":4},{"$f":"IFERROR(VLOOKUP(D67,'Contracts (April 2022)'!C54:L575,3,FALSE),\"\")","v":""}]
[{"$nulls":4},{"$f":"IFERROR(VLOOKUP(D68,'Contracts (April 2022)'!C55:L576,3,FALSE),\"\")","v":""}]
[{"$nulls":4},{"$f":"IFERROR(VLOOKUP(D69,'Contracts (April 2022)'!C56:L577,3,FALSE),\"\")","v":""}]
[{"$nulls":4},{"$f":"IFERROR(VLOOKUP(D70,'Contracts (April 2022)'!C57:L578,3,FALSE),\"\")","v":""}]
[{"$nulls":4},{"$f":"IFERROR(VLOOKUP(D71,'Contracts (April 2022)'!C58:L579,3,FALSE),\"\")","v":""}]
[{"$nulls":4},{"$f":"IFERROR(VLOOKUP(D72,'Contracts (April 2022)'!C59:L580,3,FALSE),\"\")","v":""}]
[{"$nulls":4},{"$f":"IFERROR(VLOOKUP(D73,'Contracts (April 2022)'!C60:L581,3,FALSE),\"\")","v":""}]
[{"$nulls":4},{"$f":"IFERROR(VLOOKUP(D74,'Contracts (April 2022)'!C61:L582,3,FALSE),\"\")","v":""}]
[{"$nulls":4},{"$f":"IFERROR(VLOOKUP(D75,'Contracts (April 2022)'!C62:L583,3,FALSE),\"\")","v":""}]
[{"$nulls":4},{"$f":"IFERROR(VLOOKUP(D76,'Contracts (April 2022)'!C63:L584,3,FALSE),\"\")","v":""}]
[{"$nulls":4},{"$f":"IFERROR(VLOOKUP(D77,'Contracts (April 2022)'!C64:L585,3,FALSE),\"\")","v":""}]
[{"$nulls":4},{"$f":"IFERROR(VLOOKUP(D78,'Contracts (April 2022)'!C65:L586,3,FALSE),\"\")","v":""}]
[{"$nulls":4},{"$f":"IFERROR(VLOOKUP(D79,'Contracts (April 2022)'!C66:L587,3,FALSE),\"\")","v":""}]
[{"$nulls":4},{"$f":"IFERROR(VLOOKUP(D80,'Contracts (April 2022)'!C67:L588,3,FALSE),\"\")","v":""}]
{"$rows_left_out":314}
{"sheet":"Contact Information","index":1,"n_rows":11,"n_cols":3,"rows_kept":11}
["If you wish to contact our contract specialists to provide further details - their information can be found below. "]
[]
["Category","Name","Email"]
["Capital Equipment","Shenu Devaraja","sdevaraja@healthprocanada.com "]
["Clinical - Anesthesia/Respiratory & Diagnostic Imaging/Interventional","Kacper Kolodziejczyk","kkolodziejczyk@healthprocanada.com"]
["Clinical - Med/Surg","Joon Cho","jcho@healthprocanada.com"]
["Clinical - Med/Surg","Saleha Hussain","shussain@healthprocanada.com"]
["Clinical - OR/MDR","Courtney Smith","csmith@healthprocanada.com "]
["Clinical - Wound Care & Allied Health/IPAC","Hannah Kerr","hkerr@healthprocanada.com"]
["Signature Services","Geget Marballie","gmarballie@healthprocanada.com "]
["Support Services","Gabriel Noblecilla","gnoblecilla@healthprocanada.com "]

{"sheet":"Contracts (April 2022)","index":2,"n_rows":525,"n_cols":12,"rows_kept":525,"hidden":true}
[null,"Service","Contract No.","Type","Contract Name","Contract Start Date","Contract End Date"," Option Years"," Option Years Decision","Compliance","Category Lead/Business Director","Category"]
[null,"CL","01052","CA","AWC - Impregnated Foam - Ibuprofen","2016-06-01","2023-05-31","2 Years","All Years Exercised","80%-100%","Christina Singh","WCAHI"]
[null,"CL","01138","CA","Contrast Media - Mri","2016-12-01","2023-11-30","2 Years","All Years Exercised","80%-100%","Luna Attia","ARDI"]
[null,"CL","01141","CA","Pressure Offloading Boots","2016-06-01","2022-11-30","2 Years","1.5 Years Exercised","80%-100%","Amarpreet Bambrah","MEDSURG"]
[null,"CL","01142","CA","AWC - Highly Absorbent Dressings","2016-06-01","2023-05-31","2 Years","All Years Exercised","80%-100%","Christina Singh","WCAHI"]
[null,"CL","01144","CA","Bowel Management System (BMS)","2015-06-01","2022-11-30","2 Years","All Years, plus 6 Month Extension Exercised","80%-100%","Amarpreet Bambrah","MEDSURG"]
[null,"CL","01153","CA","AWC - Protease Modulating Matrix","2016-06-01","2023-05-31","2 Years","All Years Exercised","80%-100%","Christina Singh","WCAHI"]
[null,"CL","01159","CA","AWC - Antimicrobial Honey Products","2016-06-01","2023-05-31","2 Years","All Years Exercised","80%-100%","Christina Singh","WCAHI"]
[null,"CL","01466","CA","Contrast Media - Non-Ionic","2016-12-01","2023-11-30","2 Years","All Years Exercised","80%-100%","Luna Attia","ARDI"]
[null,"CL","01468","CA","Contrast Media - Power Syringe & Accessories","2016-12-01","2023-11-30","2 Years","All Years Exercised","80%-100%","Luna Attia","ARDI"]
[null,"CL","01473","CA","Contrast Media - Oral","2016-12-01","2023-11-30","2 Years","All Years Exercised","80%-100%","Luna Attia","ARDI"]
[null,"CL","01479","CA","Vascular Grafts - Polyester","2014-12-01","2022-05-31","2 Years + 2 Years","All Years, plus 6 Month Extension Exercised.","100%","Adrienne Alexander","OR/MDR"]
[null,"CL","01479","CA","Vascular Grafts","2022-06-01","2028-05-31","2 Years","Available","80%-100%","Adrienne Alexander","OR/MDR"]
[null,"CL","01514","CA","Contrast Media - Barium","2016-12-01","2023-11-30","2 Years","All Years Exercised","80%-100%","Luna Attia","ARDI"]
[null,"CL","01604","CA","AWC - Antimicrobial - Phmb Products","2016-06-01","2023-05-31","2 Years","All Years Exercised","80%-100%","Christina Singh","WCAHI"]
[null,"CL","01606","CA","AWC - Antimicrobial Cadexomer Iodine Products","2016-06-01","2023-05-31","2 Years","All Years Exercised","80%-100%","Christina Singh","WCAHI"]
[null,"CL","01607","CA","AWC - Antimicrobial Povidone Iodine Dressings","2016-06-01","2023-05-31","2 Years","All Years Exercised","80%-100%","Christina Singh","WCAHI"]
[null,"CL","01608","CA","AWC - Biological Wound Matrix","2016-06-01","2023-05-31","2 Years","All Years Exercised","80%-100%","Christina Singh","WCAHI"]
[null,"CL","01611","CA","AWC - Contact Layer - Soft Silicone","2016-06-01","2023-05-31","2 Years","All Years Exercised","80%-100%","Christina Singh","WCAHI"]
[null,"CL","01613","CA","AWC - Debriders - Hypertonic Sodium Chloride","2016-06-01","2023-05-31","2 Years","All Years Exercised","80%-100%","Christina Singh","WCAHI"]
[null,"CL","01614","CA","AWC - Foams Dressings - Silicone","2016-06-01","2023-05-31","2 Years","All Years Exercised","80%-100%","Christina Singh","WCAHI"]
[null,"CL","01620","CA","AWC - Impregnated Bandage - Zinc","2016-06-01","2023-05-31","2 Years","All Years Exercised","80%-100%","Christina Singh","WCAHI"]
[null,"CL","01621","CA","AWC - Impregnated Gauze - Paraffin","2016-06-01","2023-05-31","2 Years","All Years Exercised","80%-100%","Christina Singh","WCAHI"]
[null,"CL","01622","CA","Wet Dressings - Isotonic Sodium Chloride","2016-06-01","2023-05-31","2 Years","All Years Exercised","80%-100%","Christina Singh","WCAHI"]
[null,"CL","01623","CA","AWC - Scar Therapy Dressings","2016-06-01","2023-05-31","2 Years","All Years Exercised","80%-100%","Christina Singh","WCAHI"]
[null,"CL","01627","CA","Skin Integrity - Specialty - Barrier Film","2021-06-01","2029-05-31","2 Years","Available","80%-100%","Christina Singh","WCAHI"]
[null,"CL","01628","CA","Skin Integrity - Adhesive Remover","2021-06-01","2029-05-31","2 Years","Available","80%-100%","Christina Singh","WCAHI"]
[null,"CL","01630","CA","AWC - Antimicrobial Silver Hydrogel","2016-06-01","2023-05-31","2 Years","All Years Exercised","80%-100%","Christina Singh","WCAHI"]
[null,"CL","01633","CA","AWC - Antimicrobial Silver Foam Dressings","2016-06-01","2023-05-31","2 Years","All Years Exercised","80%-100%","Christina Singh","WCAHI"]
[null,"CL","01634","CA","AWC - Antimicrobial Silver Sheet","2016-06-01","2023-05-31","2 Years","All Years Exercised","80%-100%","Christina Singh","WCAHI"]
[null,"CL","01635","CA","AWC - Wound Cleansers - Isotonic","2016-06-01","2023-05-31","2 Years","All Years Exercised","80%-100%","Christina Singh","WCAHI"]
[null,"CL","01649","CA","AWC - Impregnated Gauze - Petrolatum","2016-06-01","2023-05-31","2 Years","All Years Exercised","80%-100%","Christina Singh","WCAHI"]
[null,"CL","01651","CA","Tubular Elastic Bandage","2016-06-01","2024-05-31","2 Years","Available","80%-100%","Amarpreet Bambrah","MEDSURG"]
[null,"CL","01658","CA","Central Venous Catheters - Non-Cuffed","2016-06-01","2023-05-31","2 Years","All Years Exercised","80%-100%","Amarpreet Bambrah","MEDSURG"]
[null,"CL","01678","PL","Infusion Set, Integrated Automated Inserter & Transparent Film Dressing","2013-06-01","2022-11-30","1 Year + 1 Year","All Years Exercised an 2.5 Years Extension Exercised","100%","Amarpreet Bambrah","MEDSURG"]
[null,"CL","01806","CA","Drapes - Transparent & Incise","2016-12-01","2023-11-30","2 Years","All Years Exercised","80%-100%","Adrienne Alexander","OR/MDR"]
[null,"CL","01830","CA","Stockinette Casting, Cotton, Non-Sterile","2016-06-01","2023-05-31","2 Years","1.5 Years Exercised, 6 Months Available","80%-100%","Christina Singh","WCAHI"]
[null,"CL","01833","CA","Needles, Spinal & Epidural","2018-06-01","2025-05-31","2 Years + 3 Years","1 Year Exercised, 4 Years Remaining","80%-100%","Luna Attia","ARDI"]
[null,"CL","01834","CA","Endobronchial Tubes, Disposable","2016-06-01","2024-11-30","2 Years","All Years Exercised","80%-100%","Luna Attia","ARDI"]
[null,"CL","01835","CA","Anaesthesia Masks, Disposable","2016-06-01","2023-11-30","2 Years","1 Year Exercised","80%-100%","Luna Attia","ARDI"]
[null,"CL","01836","CA","Resuscitation Supplies & Accessories, Disposable","2016-06-01","2023-11-30","2 Years","1 Year Exercised","80%-100%","Luna Attia","ARDI"]
[null,"CL","01855","CA","Burn Gauze","2021-12-01","2029-05-31","2 Years","Available","80%-100%","Christina Singh","WCAHI"]
[null,"CL","01939","CA","Skin Integrity - Specialty - Zinc Barrier","2021-06-01","2029-05-31","2 Years","Available","80%-100%","Christina Singh","WCAHI"]
[null,"CL","01963","CA","Enteral Feed Delivery Systems","2019-06-01","2024-11-30","2 Years","Available","80%-100%","Amarpreet Bambrah","MEDSURG"]
[null,"CL","01965","CA","Chest Tubes","2020-12-01","2026-11-30","2 Years","Available","80%","Amarpreet Bambrah","MEDSURG"]
[null,"CL","01975","CA","Underpads-Breathable Low Air Loss Mattress Compatible & Disposable","2017-06-01","2022-11-30","2 Years","All Years Exercised","80%-100%","Amarpreet Bambrah","MEDSURG"]
[null,"CL","01976","CA","Intermediate Level Surface Disinfectants - Quaternary Ammonium Ready To Use","2017-06-01","2024-05-31","2 Years","All Years Exercised","80%-100%","Adrienne Alexander","OR/MDR"]
[null,"CL","01991","CA","Sterilization - Process Challenge Device & Biological Indicator =4 Hours","2016-12-01","2023-11-30","2 Years","All Years Exercised","80%-100%","Adrienne Alexander","OR/MDR"]
[null,"CL","02005","CA","AWC - Debriders - Polyacrylate With Ringers Solution","2016-06-01","2023-05-31","2 Years","All Years Exercised","80%-100%","Christina Singh","WCAHI"]
[null,"CL","02007","CA","Antimicrobial Silver Skin Fold Textile","2016-06-01","2023-05-31","2 Years","All Years Exercised","80%-100%","Christina Singh","WCAHI"]
[null,"CL","02017","CA","Sharps Containers, Reusable","2019-12-01","2024-11-30","2 Years","Available","80%-100%","Christina Singh","WCAHI"]
[null,"CL","02019","PL","Patient Turn & Position System","2016-06-01","2022-11-30","2 Years","1 Year and 6 Months Exercised. 6 Months Remaining","80%-100%","Amarpreet Bambrah","MEDSURG"]
[null,"CL","02216","CA","Casting - Undercast Padding - Non-Synthetic","2016-12-01","2023-05-31","2 Years","1.5 Years Exercised, 6 Months Available","80%-100%","Christina Singh","WCAHI"]
[null,"CL","02218","CA","Suture & Staple Removers","2016-12-01","2023-11-30","2 Years","All Years Exercised","80%-100%","Amarpreet Bambrah","MEDSURG"]
[null,"CL","02237","CA","Respiratory - Humidifiers & Large Volume Nebulizers - Empty And Prefilled","2017-12-01","2024-11-30","2 Years","All Years Exercised","80%-100%","Luna Attia","ARDI"]
[null,"CL","02240","CA","Intermediate Level Surface Disinfectants - Hydrogen Peroxide Enhanced Action Formula (Hp-Eaf) Ready To Use","2017-12-01","2024-05-31","2 Years","All Years Exercised","80%-100%","Christina Singh","WCAHI"]
[null,"CL","02258","CA","Respiratory - HCH, HME And Filters","2017-12-01","2023-11-30","2 Years","1 Year Exercised","80%-100%","Luna Attia","ARDI"]
[null,"CL","02260","CA","Respiratory - Heated Ventilation Circuits","2017-12-01","2024-11-30","2 Years","All Years Exercised","80%-100%","Luna Attia","ARDI"]
[null,"CL","02263","CA","ERCP: Sphincterotomes","2017-12-01","2024-11-30","2 Years","All Years Exercised","80%-100%","Adrienne Alexander","OR/MDR"]
[null,"CL","02264","CA","GI: Dilation - Non-Biliary - Balloons","2017-12-01","2024-11-30","2 Years","All Years Exercised","80%-100%","Adrienne Alexander","OR/MDR"]
[null,"CL","02265","CA","ERCP: Guidewires","2017-12-01","2024-11-30","2 Years","All Years Exercised","80%-100%","Adrienne Alexander","OR/MDR"]
[null,"CL","02266","CA","GI: Polypectomy Snares","2017-12-01","2024-11-30","2 Years","All Years Exercised","80%-100%","Adrienne Alexander","OR/MDR"]
[null,"CL","02267","CA","ERCP: Biliary Extraction Balloons & Baskets","2017-12-01","2024-11-30","2 Years","All Years Exercised","80%-100%","Adrienne Alexander","OR/MDR"]
[null,"CL","02268","CA","ERCP: Metal Stents - Biliary","2017-12-01","2024-11-30","2 Years","All Years Exercised","80%-100%","Adrienne Alexander","OR/MDR"]
[null,"CL","02269","CA","ERCP: Plastic Stents - Biliary","2017-12-01","2024-11-30","2 Years","All Years Exercised","80%-100%","Adrienne Alexander","OR/MDR"]
[null,"CL","02270","CA","GI: Metal Stents - Non-Biliary - Esophageal","2017-12-01","2024-11-30","2 Years","All Years Exercised","80%-100%","Adrienne Alexander","OR/MDR"]
[null,"CL","02271","CA","GI: Cytology Brush","2017-12-01","2024-11-30","2 Years","All Years Exercised","80%-100%","Adrienne Alexander","OR/MDR"]
[null,"CL","02272","CA","GI: Hemostasis Supplies (Ligation)","2017-12-01","2024-11-30","2 Years","All Years Exercised","80%-100%","Adrienne Alexander","OR/MDR"]
[null,"CL","02273","CA","GI: Hemostasis Supplies (Clips)","2017-12-01","2024-11-30","2 Years","All Years Exercised","80%-100%","Adrienne Alexander","OR/MDR"]
[null,"CL","02274","CA","GI: Hemostasis Supplies (Probes)","2017-12-01","2024-11-30","2 Years","All Years Exercised","80%-100%","Adrienne Alexander","OR/MDR"]
[null,"CL","02275","CA","GI: Hemostasis Supplies (Injection Needles)","2017-12-01","2024-11-30","2 Years","All Years Exercised","80%-100%","Adrienne Alexander","OR/MDR"]
[null,"CL","02276","CA","GI: Metal Stents - Non-Biliary - Duodenal/Pyloric","2017-12-01","2024-11-30","2 Years","All Years Exercised","80%-100%","Adrienne Alexander","OR/MDR"]
[null,"CL","02277","CA","GI: Metal Stent - Non-Biliary - Colonic","2017-12-01","2024-11-30","2 Years","All Years Exercised","80%-100%","Adrienne Alexander","OR/MDR"]
[null,"CL","02278","CA","ERCP: Cannula","2017-12-01","2024-11-30","2 Years","All Years Exercised","80%-100%","Adrienne Alexander","OR/MDR"]
[null,"CL","02281","CA","GI: Bite Blocks","2017-12-01","2024-11-30","2 Years","All Years Exercised","80%-100%","Adrienne Alexander","OR/MDR"]
[null,"CL","02282","CA","GI: Cleaning Brushes","2017-12-01","2024-11-30","2 Years","All Years Exercised","80%-100%","Adrienne Alexander","OR/MDR"]
[null,"CL","02283","CA","GI: Biopsy Forceps","2017-12-01","2024-11-30","2 Years","All Years Exercised","80%-100%","Adrienne Alexander","OR/MDR"]
[null,"CL","02285","CA","ERCP: Plastic Stents - Pancreatic","2017-12-01","2024-11-30","2 Years","All Years Exercised","80%-100%","Adrienne Alexander","OR/MDR"]
[null,"CL","02290","CA","Instruments, Surgical","2019-12-01","2026-05-31","2 Years","Available","80%-100%","Adrienne Alexander","OR/MDR"]
[null,"CL","02291","CA","Instruments, Utility","2019-12-01","2026-05-31","2 Years","Available","80%-100%","Adrienne Alexander","OR/MDR"]
{"$rows_left_out":445}